BDBM50093696 6-(3-Fluoro-phenyl)-2-methyl-4-piperidin-1-yl-5H-pyrrolo[3,2-d]pyrimidine::CHEMBL343817
SMILES Cc1nc(N2CCCCC2)c2[nH]c(cc2n1)-c1cccc(F)c1
InChI Key InChIKey=ACQGVBPBJCIRKA-UHFFFAOYSA-N
Data  1 IC50
  Tab Delimited (TSV)   2D SDfile   Computed 3D by Vconf -m prep SDfile
Find this compound or compounds like it in BindingDB:
Activity Spreadsheet -- Enzyme Inhibition Constant Data from BindingDB
Found 1 hit for monomerid = 50093696
TargetNeuropeptide Y receptor type 5(Homo sapiens (Human))
Amgen
Curated by ChEMBL
LigandPNGBDBM50093696(6-(3-Fluoro-phenyl)-2-methyl-4-piperidin-1-yl-5H-p...)
Affinity DataIC50:  0.300nM. Assay description: Affinity for human neuropeptide Y receptor Y5, binding was evaluated in an in vitro radioligand [125I]-PYY binding assay
In DepthDetails ArticlePubMed