BDBM50093718 (6R,7R)-7-[2-(4-Hydroxy-phenyl)-acetylamino]-7-methoxy-3-(1-methyl-2,3-dihydro-1H-tetrazol-5-ylsulfanylmethyl)-8-oxo-5-oxa-1-aza-bicyclo[4.2.0]oct-2-ene-2-carboxylic acid 3-trifluoromethyl-benzyl ester::CHEMBL78842
SMILES CO[C@]1(NC(=O)Cc2ccc(O)cc2)[C@H]2OCC(CSc3nnnn3C)=C(N2C1=O)C(=O)OCc1cccc(c1)C(F)(F)F
InChI Key InChIKey=MVGBVIHZEAHDJZ-RSXGOPAZSA-N
Data  1 IC50
  Tab Delimited (TSV)   2D SDfile   Computed 3D by Vconf -m prep SDfile
Find this compound or compounds like it in BindingDB:
Activity Spreadsheet -- Enzyme Inhibition Constant Data from BindingDB
Found 1 hit for monomerid = 50093718
TargetChymase(Homo sapiens (Human))
Shionogi
Curated by ChEMBL
LigandPNGBDBM50093718((6R,7R)-7-[2-(4-Hydroxy-phenyl)-acetylamino]-7-met...)
Affinity DataIC50:  50nM. Assay description: Inhibitory activity against human serine protease chymase
In DepthDetails ArticlePubMed