BDBM50093723 (6R,7R)-7-[2-(4-Hydroxy-phenyl)-acetylamino]-7-methoxy-3-(4-methyl-4H-[1,2,4]triazol-3-ylsulfanylmethyl)-8-oxo-5-oxa-1-aza-bicyclo[4.2.0]oct-2-ene-2-carboxylic acid 3-methyl-benzyl ester::CHEMBL77602
SMILES CO[C@]1(NC(=O)Cc2ccc(O)cc2)[C@H]2OCC(CSc3nncn3C)=C(N2C1=O)C(=O)OCc1cccc(C)c1
InChI Key InChIKey=YBVRRFZIZSLREU-IAPPQJPRSA-N
Data  1 IC50
  Tab Delimited (TSV)   2D SDfile   Computed 3D by Vconf -m prep SDfile
Find this compound or compounds like it in BindingDB:
Activity Spreadsheet -- Enzyme Inhibition Constant Data from BindingDB
Found 1 hit for monomerid = 50093723
TargetChymase(Homo sapiens (Human))
Shionogi
Curated by ChEMBL
LigandPNGBDBM50093723((6R,7R)-7-[2-(4-Hydroxy-phenyl)-acetylamino]-7-met...)
Affinity DataIC50:  4.00E+3nM. Assay description: Inhibitory activity against human serine protease chymase
In DepthDetails ArticlePubMed