BDBM50093727 (6R,7R)-7-Methoxy-7-(2-methoxy-benzoylamino)-3-(1-methyl-1H-tetrazol-5-ylsulfanylmethyl)-8-oxo-5-oxa-1-aza-bicyclo[4.2.0]oct-2-ene-2-carboxylic acid benzhydryl ester::(6R,7R)-7-Methoxy-7-(2-methoxy-benzoylamino)-3-(1-methyl-2,3-dihydro-1H-tetrazol-5-ylsulfanylmethyl)-8-oxo-5-oxa-1-aza-bicyclo[4.2.0]oct-2-ene-2-carboxylic acid benzhydryl ester::CHEMBL309201
SMILES COc1ccccc1C(=O)N[C@@]1(OC)[C@H]2OCC(CSc3nnnn3C)=C(N2C1=O)C(=O)OC(c1ccccc1)c1ccccc1
InChI Key InChIKey=KDKQAXWXGRXWQJ-BHYZAODMSA-N
Data  2 IC50
  Tab Delimited (TSV)   2D SDfile   Computed 3D by Vconf -m prep SDfile
Find this compound or compounds like it in BindingDB:
Activity Spreadsheet -- Enzyme Inhibition Constant Data from BindingDB
Found 2 hits for monomerid = 50093727
TargetChymase(Homo sapiens (Human))
Shionogi
Curated by ChEMBL
LigandPNGBDBM50093727((6R,7R)-7-Methoxy-7-(2-methoxy-benzoylamino)-3-(1-...)
Affinity DataIC50:  550nM. Assay description: Inhibition of human Serine protease chymase
In DepthDetails ArticlePubMed
TargetChymase(Homo sapiens (Human))
Shionogi
Curated by ChEMBL
LigandPNGBDBM50093727((6R,7R)-7-Methoxy-7-(2-methoxy-benzoylamino)-3-(1-...)
Affinity DataIC50:  550nM. Assay description: Inhibitory activity against human serine protease chymase
In DepthDetails ArticlePubMed