BDBM50093747 (6R,7R)-7-(2-sec-Butoxy-benzoylamino)-7-methoxy-3-(1-methyl-1H-tetrazol-5-ylsulfanylmethyl)-8-oxo-5-oxa-1-aza-bicyclo[4.2.0]oct-2-ene-2-carboxylic acid 4-carboxy-benzyl ester::CHEMBL80420
SMILES CCC(C)Oc1ccccc1C(=O)N[C@@]1(OC)[C@H]2OCC(CSc3nnnn3C)=C(N2C1=O)C(=O)OCc1ccc(cc1)C(O)=O
InChI Key InChIKey=LAUXLSDKSVJYHF-QNBVWDSKSA-N
Data  1 IC50
  Tab Delimited (TSV)   2D SDfile   Computed 3D by Vconf -m prep SDfile
Find this compound or compounds like it in BindingDB:
Activity Spreadsheet -- Enzyme Inhibition Constant Data from BindingDB
Found 1 hit for monomerid = 50093747
TargetChymase(Homo sapiens (Human))
Shionogi
Curated by ChEMBL
LigandPNGBDBM50093747((6R,7R)-7-(2-sec-Butoxy-benzoylamino)-7-methoxy-3-...)
Affinity DataIC50:  26nM. Assay description: Inhibition of human Serine protease chymase
In DepthDetails ArticlePubMed