BDBM50093750 (6R,7R)-3-(1-Carboxymethyl-1H-tetrazol-5-ylsulfanylmethyl)-7-methoxy-7-(2-methoxy-benzoylamino)-8-oxo-5-oxa-1-aza-bicyclo[4.2.0]oct-2-ene-2-carboxylic acid 3-methyl-benzyl ester::CHEMBL82346
SMILES COc1ccccc1C(=O)N[C@@]1(OC)[C@H]2OCC(CSc3nnnn3CC(O)=O)=C(N2C1=O)C(=O)OCc1cccc(C)c1
InChI Key InChIKey=WWSPYUUDJNNJFH-IAPPQJPRSA-N
Data  1 IC50
  Tab Delimited (TSV)   2D SDfile   Computed 3D by Vconf -m prep SDfile
Find this compound or compounds like it in BindingDB:
Activity Spreadsheet -- Enzyme Inhibition Constant Data from BindingDB
Found 1 hit for monomerid = 50093750
TargetChymase(Homo sapiens (Human))
Shionogi
Curated by ChEMBL
LigandPNGBDBM50093750((6R,7R)-3-(1-Carboxymethyl-1H-tetrazol-5-ylsulfany...)
Affinity DataIC50:  6nM. Assay description: Inhibition of human Serine protease chymase
In DepthDetails ArticlePubMed