BDBM50093798 CHEMBL3585951
SMILES Cc1ncc(OC[C@]2(C[C@H]2C(=O)Nc2cc(C)c(F)cn2)c2ccccc2)c(C)n1
InChI Key InChIKey=RFPNQRQTMCELCI-SFHVURJKSA-N
Data  2 KI  1 IC50
  Tab Delimited (TSV)   2D SDfile   Computed 3D by Vconf -m prep SDfile
Find this compound or compounds like it in BindingDB:
Activity Spreadsheet -- Enzyme Inhibition Constant Data from BindingDB
Found 3 hits for monomerid = 50093798
TargetOrexin receptor type 2(Homo sapiens (Human))
Eisai
Curated by ChEMBL
LigandPNGBDBM50093798(CHEMBL3585951)
Affinity DataKi:  4nM. Assay description: Binding affinity to human OX2R by radioligand displacement binding assay
In DepthDetails ArticlePubMed
TargetOrexin/Hypocretin receptor type 1(Homo sapiens (Human))
Eisai
Curated by ChEMBL
LigandPNGBDBM50093798(CHEMBL3585951)
Affinity DataKi:  6nM. Assay description: Binding affinity to human OX1R by radioligand displacement binding assay
In DepthDetails ArticlePubMed
TargetPotassium voltage-gated channel subfamily H member 2(Homo sapiens (Human))
Eisai
Curated by ChEMBL
LigandPNGBDBM50093798(CHEMBL3585951)
Affinity DataIC50: >1.00E+4nM. Assay description: Inhibition of human ERG
In DepthDetails ArticlePubMed