BDBM50093801 CHEMBL3585949
SMILES Cc1ccc(NC(=O)[C@@H]2C[C@@]2(COc2cnc(C)nc2C)c2ccccc2)nc1
InChI Key InChIKey=MHTPGHOORJOWRZ-WMZHIEFXSA-N
Data  2 KI
  Tab Delimited (TSV)   2D SDfile   Computed 3D by Vconf -m prep SDfile
Find this compound or compounds like it in BindingDB:
Activity Spreadsheet -- Enzyme Inhibition Constant Data from BindingDB
Found 2 hits for monomerid = 50093801
TargetOrexin receptor type 2(Homo sapiens (Human))
Eisai
Curated by ChEMBL
LigandPNGBDBM50093801(CHEMBL3585949)
Affinity DataKi:  34nM. Assay description: Binding affinity to human OX2R by radioligand displacement binding assay
In DepthDetails ArticlePubMed
TargetOrexin/Hypocretin receptor type 1(Homo sapiens (Human))
Eisai
Curated by ChEMBL
LigandPNGBDBM50093801(CHEMBL3585949)
Affinity DataKi:  124nM. Assay description: Binding affinity to human OX1R by radioligand displacement binding assay
In DepthDetails ArticlePubMed