BDBM50093810 (S)-2-(3-Chloro-5-{1-[3-chloro-5-((S)-1,2-dicarboxy-ethylcarbamoyl)-4-hydroxy-phenyl]-4-[(3S,10S,13R,17R)-17-(1,5-dimethyl-hexyl)-10,13-dimethyl-hexadecahydro-cyclopenta[a]phenanthren-3-yl]-but-1-enyl}-2-hydroxy-benzoylamino)-succinic acid::2-(3-Chloro-5-{1-[3-chloro-5-(1,2-dicarboxy-ethylcarbamoyl)-4-hydroxy-phenyl]-4-[17-(1,5-dimethyl-hexyl)-10,13-dimethyl-hexadecahydro-cyclopenta[a]phenanthren-3-yl]-but-1-enyl}-2-hydroxy-benzoylamino)-succinic acid::CHEMBL265031
SMILES [#6]-[#6](-[#6])-[#6]-[#6]-[#6]-[#6](-[#6])-[#6@H]1-[#6]-[#6]-[#6]2-[#6]-3-[#6]-[#6]-[#6]4-[#6]-[#6@@H](-[#6]-[#6]\[#6]=[#6](\c5cc(Cl)c(-[#8])c(c5)-[#6](=O)-[#7]-[#6@@H](-[#6]-[#6](-[#8])=O)-[#6](-[#8])=O)-c5cc(Cl)c(-[#8])c(c5)-[#6](=O)-[#7]-[#6@@H](-[#6]-[#6](-[#8])=O)-[#6](-[#8])=O)-[#6]-[#6][C@]4([#6])[#6]-3-[#6]-[#6][C@]12[#6]
InChI Key InChIKey=PHKHNFRWBACUFW-YTTMOGQDSA-N
Data  1 EC50
  Tab Delimited (TSV)   2D SDfile   Computed 3D by Vconf -m prep SDfile
Find this compound or compounds like it in BindingDB:
Activity Spreadsheet -- Enzyme Inhibition Constant Data from BindingDB
Found 1 hit for monomerid = 50093810
TargetT-cell surface glycoprotein CD4(Homo sapiens (Human))
Purdue University
Curated by ChEMBL
LigandPNGBDBM50093810((S)-2-(3-Chloro-5-{1-[3-chloro-5-((S)-1,2-dicarbox...)
Affinity DataEC50:  1.22E+5nM. Assay description: In vitro inhibition of cytopathic effect was determined against HIV-2 ROD in MT-4 cells using MTS cytoprotection assay
In DepthDetails ArticlePubMed