BDBM50093820 (2R,3S)-2-(3,4-Dichloro-phenylamino)-3-methyl-pentanoic acid [(R)-1-hydroxycarbamoyl-2-(1H-indol-2-yl)-ethyl]-amide::CHEMBL84324
SMILES CC[C@H](C)[C@@H](Nc1ccc(Cl)c(Cl)c1)C(=O)N[C@H](Cc1cc2ccccc2[nH]1)C(=O)NO
InChI Key InChIKey=PIZSNAOJXUXHCN-JDORSLCVSA-N
Data  1 IC50
  Tab Delimited (TSV)   2D SDfile   Computed 3D by Vconf -m prep SDfile
Find this compound or compounds like it in BindingDB:
Activity Spreadsheet -- Enzyme Inhibition Constant Data from BindingDB
Found 1 hit for monomerid = 50093820
TargetBone morphogenetic protein 1(Homo sapiens (Human))
Roche Bioscience
Curated by ChEMBL
LigandPNGBDBM50093820((2R,3S)-2-(3,4-Dichloro-phenylamino)-3-methyl-pent...)
Affinity DataIC50:  750nM. Assay description: Inhibitory effect against Procollagen C-terminal proteinase
In DepthDetails ArticlePubMed