BDBM50093965 CHEMBL86324::N-Methyl-N-((S)-1-phenyl-2-pyrrolidin-1-yl-ethyl)-2-(4-trifluoromethyl-phenyl)-acetamide
SMILES CN([C@H](CN1CCCC1)c1ccccc1)C(=O)Cc1ccc(cc1)C(F)(F)F
InChI Key InChIKey=RLRSONQNLJWHBO-HXUWFJFHSA-N
Data  2 KI
  Tab Delimited (TSV)   2D SDfile   Computed 3D by Vconf -m prep SDfile
Find this compound or compounds like it in BindingDB:
Activity Spreadsheet -- Enzyme Inhibition Constant Data from BindingDB
Found 2 hits for monomerid = 50093965
TargetKappa-type opioid receptor(Homo sapiens (Human))
Adolor
Curated by ChEMBL
LigandPNGBDBM50093965(CHEMBL86324 | N-Methyl-N-((S)-1-phenyl-2-pyrrolidi...)
Affinity DataKi:  0.0580nM. Assay description: Displacement of bound [3H]-diprenorphine from membranes expressing cloned human kappa opioid receptor
In DepthDetails ArticlePubMed
TargetKappa-type opioid receptor(Homo sapiens (Human))
Adolor
Curated by ChEMBL
LigandPNGBDBM50093965(CHEMBL86324 | N-Methyl-N-((S)-1-phenyl-2-pyrrolidi...)
Affinity DataKi:  0.0580nM. Assay description: In vitro binding affinity towards Opioid receptor kappa 1 by displacement of bound [3H]U69,593
In DepthDetails ArticlePubMed