BDBM50094029 CHEMBL137407::Propane-2-sulfonic acid [2-(4-tert-butyl-phenyl)-pentyl]-amide
SMILES CCCC(CNS(=O)(=O)C(C)C)c1ccc(cc1)C(C)(C)C
InChI Key InChIKey=PLFJLRCHPAGOKH-UHFFFAOYSA-N
Data  1 EC50
  Tab Delimited (TSV)   2D SDfile   Computed 3D by Vconf -m prep SDfile
Find this compound or compounds like it in BindingDB:
Activity Spreadsheet -- Enzyme Inhibition Constant Data from BindingDB
Found 1 hit for monomerid = 50094029
TargetGlutamate receptor 4(Homo sapiens (Human))
Nps Allelix
Curated by ChEMBL
LigandPNGBDBM50094029(CHEMBL137407 | Propane-2-sulfonic acid [2-(4-tert-...)
Affinity DataEC50:  2.79E+4nM. Assay description: Tested for potentiation towards human iGluR4 receptor expressed in HEK293 cells
In DepthDetails ArticlePubMed