BDBM50094241 CHEMBL2430509
SMILES Cc1ccc(OCc2cn(nn2)-c2ccc(cc2)S(=O)(=O)NCCc2ccccc2)cc1
InChI Key InChIKey=USAPUCSPDYTFQI-UHFFFAOYSA-N
Data  1 IC50
  Tab Delimited (TSV)   2D SDfile   Computed 3D by Vconf -m prep SDfile
Find this compound or compounds like it in BindingDB:
Activity Spreadsheet -- Enzyme Inhibition Constant Data from BindingDB
Found 1 hit for monomerid = 50094241
TargetAromatase(Homo sapiens (Human))
Srinakharinwirot University
Curated by ChEMBL
LigandPNGBDBM50094241(CHEMBL2430509)
Affinity DataIC50:  8.00E+3nM. Assay description: Inhibition of CYP19 (unknown origin) using O-benzyl fluorescein benzyl ester substrate preincubated for 10 mins by fluorimetric analysis relative to ...
In DepthDetails ArticlePubMed