BDBM50095111 4-{(4R,5R)-2-[4-(Benzo[1,3]dioxole-5-sulfonyl)-phenyl]-4,5-dimethyl-[1,3]dioxolan-2-yl}-[1,4']bipiperidinyl-1'-carboxylic acid ethyl ester::CHEMBL328094
SMILES CCOC(=O)N1CCC(CC1)N1CCC(CC1)C1(O[C@H](C)[C@@H](C)O1)c1ccc(cc1)S(=O)(=O)c1ccc2OCOc2c1
InChI Key InChIKey=OPNMQJACZADLMN-FGZHOGPDSA-N
Data  1 KI
  Tab Delimited (TSV)   2D SDfile   Computed 3D by Vconf -m prep SDfile
Find this compound or compounds like it in BindingDB:
Activity Spreadsheet -- Enzyme Inhibition Constant Data from BindingDB
Found 1 hit for monomerid = 50095111
TargetMuscarinic acetylcholine receptor M2(Homo sapiens (Human))
Schering-Plough Research Institute
Curated by ChEMBL
LigandPNGBDBM50095111(4-{(4R,5R)-2-[4-(Benzo[1,3]dioxole-5-sulfonyl)-phe...)
Affinity DataKi:  0.0300nM. Assay description: Binding affinity at human cloned acetylcholine receptor M2 in CHO cells.
In DepthDetails ArticlePubMed