BDBM50095144 CHEMBL3589520
SMILES COc1cccc(CO[C@H]2CN(CCc3ccccc3)C(=O)CN(C2)C(=O)[C@@H]2CNC(=O)C2)c1
InChI Key InChIKey=JJMIZLUGTBURSK-NOOOWODRSA-N
Data  1 IC50
  Tab Delimited (TSV)   2D SDfile   Computed 3D by Vconf -m prep SDfile
Find this compound or compounds like it in BindingDB:
Activity Spreadsheet -- Enzyme Inhibition Constant Data from BindingDB
Found 1 hit for monomerid = 50095144
TargetInhibin beta A chain(Mus musculus)
Northwestern University
Curated by ChEMBL
LigandPNGBDBM50095144(CHEMBL3589520)
Affinity DataIC50: >1.00E+5nM. Assay description: Antagonist activity at activin A in mouse LbetaT2 cells transfected with -338 promoter region of FSHbeta gene conjugated to luciferase reporter asses...
In DepthDetails ArticlePubMed