BDBM50095364 5-(1-Ethyl-propyl)-7-(6-morpholin-4-yl-pyridin-3-yl)-pyrido[2,3-d]pyrimidin-4-ylamine::CHEMBL168703
SMILES CCC(CC)c1cc(nc2ncnc(N)c12)-c1ccc(nc1)N1CCOCC1
InChI Key InChIKey=JGGMRYXLZPIOPO-UHFFFAOYSA-N
Data  2 IC50
  Tab Delimited (TSV)   2D SDfile   Computed 3D by Vconf -m prep SDfile
Find this compound or compounds like it in BindingDB:
Activity Spreadsheet -- Enzyme Inhibition Constant Data from BindingDB
Found 2 hits for monomerid = 50095364
TargetAdenosine kinase(Rattus norvegicus (rat))
Abbott Laboratories
Curated by ChEMBL
LigandPNGBDBM50095364(5-(1-Ethyl-propyl)-7-(6-morpholin-4-yl-pyridin-3-y...)
Affinity DataIC50:  9nM. Assay description: Inhibitory activity against cytosolic adenosine kinase by ADO phosphorylation assay
In DepthDetails ArticlePubMed
TargetAdenosine kinase(Rattus norvegicus (rat))
Abbott Laboratories
Curated by ChEMBL
LigandPNGBDBM50095364(5-(1-Ethyl-propyl)-7-(6-morpholin-4-yl-pyridin-3-y...)
Affinity DataIC50:  115nM. Assay description: Inhibitory activity against intact cell adenosine kinase by ADO phosphorylation assay
In DepthDetails ArticlePubMed