BDBM50095427 5-tert-Butyl-3-[3-(2,3-dichloro-phenyl)-ureido]-1-methyl-1H-pyrrole-2-carboxylic acid methyl ester::CHEMBL19057
SMILES COC(=O)c1c(NC(=O)Nc2cccc(Cl)c2Cl)cc(n1C)C(C)(C)C
InChI Key InChIKey=VZFJFMXMIJCYNK-UHFFFAOYSA-N
Data  1 IC50
  Tab Delimited (TSV)   2D SDfile   Computed 3D by Vconf -m prep SDfile
Find this compound or compounds like it in BindingDB:
Activity Spreadsheet -- Enzyme Inhibition Constant Data from BindingDB
Found 1 hit for monomerid = 50095427
TargetMitogen-activated protein kinase 14(Homo sapiens (Human))
Bayer Research Center
Curated by ChEMBL
LigandPNGBDBM50095427(5-tert-Butyl-3-[3-(2,3-dichloro-phenyl)-ureido]-1-...)
Affinity DataIC50:  387nM. Assay description: In vitro inhibition of mitogen-activated protein kinase p38 alpha 2 derived from E. coli
In DepthDetails ArticlePubMed