BDBM50095661 CHEMBL146464::N-(1-Benzyl-piperidin-4-yl)-2-cyclopentyl-2-hydroxy-2-phenyl-acetamide
SMILES OC(C1CCCC1)(C(=O)NC1CCN(Cc2ccccc2)CC1)c1ccccc1
InChI Key InChIKey=CJDXHNZNBXVNIP-UHFFFAOYSA-N
Data  3 KI
  Tab Delimited (TSV)   2D SDfile   Computed 3D by Vconf -m prep SDfile
Find this compound or compounds like it in BindingDB:
Activity Spreadsheet -- Enzyme Inhibition Constant Data from BindingDB
Found 3 hits for monomerid = 50095661
TargetMuscarinic acetylcholine receptor M3(Homo sapiens (Human))
Banyu Tsukuba Research Institute In Collaboration With Merck Research Laboratories
Curated by ChEMBL
LigandPNGBDBM50095661(CHEMBL146464 | N-(1-Benzyl-piperidin-4-yl)-2-cyclo...)
Affinity DataKi:  2.5nM. Assay description: Inhibition of [3H]-NMS binding to human muscarinic acetylcholine receptor M3 expressed in CHO cells
In DepthDetails ArticlePubMed
TargetMuscarinic acetylcholine receptor M1(Homo sapiens (Human))
Banyu Tsukuba Research Institute In Collaboration With Merck Research Laboratories
Curated by ChEMBL
LigandPNGBDBM50095661(CHEMBL146464 | N-(1-Benzyl-piperidin-4-yl)-2-cyclo...)
Affinity DataKi:  2.60nM. Assay description: Inhibition of [3H]-NMS binding to human muscarinic acetylcholine receptor M1 expressed in CHO cells
In DepthDetails ArticlePubMed
TargetMuscarinic acetylcholine receptor M2(Homo sapiens (Human))
Banyu Tsukuba Research Institute In Collaboration With Merck Research Laboratories
Curated by ChEMBL
LigandPNGBDBM50095661(CHEMBL146464 | N-(1-Benzyl-piperidin-4-yl)-2-cyclo...)
Affinity DataKi:  30nM. Assay description: Inhibition of [3H]-NMS binding to human muscarinic acetylcholine receptor M2 expressed in CHO cells
In DepthDetails ArticlePubMed