BDBM50095794 CHEMBL3590494
SMILES [O-]S(=O)(=O)C(F)(F)F.Cc1ccccc1-c1ccc(cc1)C#Cc1cccc(C#Cc2ccc(cc2)-c2ccccc2C)[n+]1C
InChI Key InChIKey=JSCXVIYSYVZCSX-UHFFFAOYSA-M
Data  1 KI  1 Kd
  Tab Delimited (TSV)   2D SDfile   Computed 3D by Vconf -m prep SDfile
Find this compound or compounds like it in BindingDB:
Activity Spreadsheet -- Enzyme Inhibition Constant Data from BindingDB
Found 2 hits for monomerid = 50095794
TargetPotassium voltage-gated channel subfamily H member 2(Homo sapiens (Human))
Leiden University
Curated by ChEMBL
LigandPNGBDBM50095794(CHEMBL3590494)
Affinity DataKi:  577nM. Assay description: Displacement of [3H]dofetilide from human Kv11.1 expressed in HEK293 cell membranes by competitive radioligand displacement assay
In DepthDetails ArticlePubMed
TargetPotassium voltage-gated channel subfamily H member 2(Homo sapiens (Human))
Leiden University
Curated by ChEMBL
LigandPNGBDBM50095794(CHEMBL3590494)
Affinity DataKd:  203nM. Assay description: Binding affinity to human Kv11.1 expressed in HEK293 cell membranes assessed as binding affinity constant by [3H]dofetilide competition association a...
In DepthDetails ArticlePubMed