BDBM50096160 4-[2-(8-Hydroxy-7,8-dihydro-6H-imidazo[4,5-d][1,3]diazepin-3-yl)-ethyl]-8-trifluoromethyl-naphthalene-2-carboxylic acid ethyl ester::CHEMBL156756
SMILES CCOC(=O)c1cc(CCn2cnc3C(O)CNC=Nc23)c2cccc(c2c1)C(F)(F)F
InChI Key InChIKey=IJLTVCOLSADGPX-UHFFFAOYSA-N
Data  2 KI
  Tab Delimited (TSV)   2D SDfile   Computed 3D by Vconf -m prep SDfile
Find this compound or compounds like it in BindingDB:
Activity Spreadsheet -- Enzyme Inhibition Constant Data from BindingDB
Found 2 hits for monomerid = 50096160
TargetAdenosine deaminase(Bos taurus (bovine))
Metabasis Therapeutics
Curated by ChEMBL
LigandPNGBDBM50096160(4-[2-(8-Hydroxy-7,8-dihydro-6H-imidazo[4,5-d][1,3]...)
Affinity DataKi:  2.70E+3nM. Assay description: Inhibition of Calf intestinal adenosine deaminase (ADA).
In DepthDetails ArticlePubMed
TargetAMP deaminase 3(Homo sapiens (Human))
Metabasis Therapeutics
Curated by ChEMBL
LigandPNGBDBM50096160(4-[2-(8-Hydroxy-7,8-dihydro-6H-imidazo[4,5-d][1,3]...)
Affinity DataKi:  3.50E+4nM. Assay description: Inhibition of recombinant human E-type adenylate deaminase
In DepthDetails ArticlePubMed