BDBM50096162 1,3-Dichloro-4-[2-(8-hydroxy-7,8-dihydro-6H-imidazo[4,5-d][1,3]diazepin-3-yl)-ethyl]-5,6,7,8-tetrahydro-naphthalene-2-carboxylic acid benzyl ester::CHEMBL350676
SMILES OC1CNC=Nc2c1ncn2CCc1c(Cl)c(C(=O)OCc2ccccc2)c(Cl)c2CCCCc12
InChI Key InChIKey=BTMGEDFAWKMHMZ-UHFFFAOYSA-N
Data  2 KI
  Tab Delimited (TSV)   2D SDfile   Computed 3D by Vconf -m prep SDfile
Find this compound or compounds like it in BindingDB:
Activity Spreadsheet -- Enzyme Inhibition Constant Data from BindingDB
Found 2 hits for monomerid = 50096162
TargetAMP deaminase 3(Homo sapiens (Human))
Metabasis Therapeutics
Curated by ChEMBL
LigandPNGBDBM50096162(1,3-Dichloro-4-[2-(8-hydroxy-7,8-dihydro-6H-imidaz...)
Affinity DataKi:  300nM. Assay description: Inhibition of recombinant human E-type adenylate deaminase
In DepthDetails ArticlePubMed
TargetAdenosine deaminase(Bos taurus (bovine))
Metabasis Therapeutics
Curated by ChEMBL
LigandPNGBDBM50096162(1,3-Dichloro-4-[2-(8-hydroxy-7,8-dihydro-6H-imidaz...)
Affinity DataKi: >7.50E+3nM. Assay description: Inhibition of Calf intestinal adenosine deaminase (ADA).
In DepthDetails ArticlePubMed