BDBM50096257 CHEMBL3594280
SMILES [H][C@@]1(C[C@H](O)[C@H](O[C@@]2([H])C[C@H](O)[C@H](O[C@@]3([H])C[C@H](O)[C@H](O)[C@@H](C)O3)[C@@H](C)O2)[C@@H](C)O1)O[C@H]1CC[C@@]2(C)[C@]([H])(CC[C@]3([H])[C@]2([H])C[C@@H](O)[C@]2(C)[C@H](CC[C@]32O)C2=CC(=O)O\C2=C/c2cccc(c2)[N+]([O-])=O)C1
InChI Key InChIKey=CHHJGGLFTSGUPZ-REODVXNFSA-N
Data  1 IC50
  Tab Delimited (TSV)   2D SDfile   Computed 3D by Vconf -m prep SDfile
Find this compound or compounds like it in BindingDB:
Activity Spreadsheet -- Enzyme Inhibition Constant Data from BindingDB
Found 1 hit for monomerid = 50096257
TargetSodium/potassium-transporting ATPase subunit alpha-1(Homo sapiens (Human))
Universidade Federal De S£O Jo£O Del Rei
Curated by ChEMBL
LigandPNGBDBM50096257(CHEMBL3594280)
Affinity DataIC50:  1.10E+4nM. Assay description: Inhibition of human kidney Na(+)/K(+) ATPase alpha-1 assessed as amount of Pi release after 1 hr by colorimetric method
In DepthDetails ArticlePubMed