BDBM50096550 1'-[4-methyl(phenyl)sulfonamido-3-(2-thienyl)butyl]spiro[2,3-dihydrobenzo[b]thiophene-1,1-dioxide-3,4'-(hexahydropyridine)]::CHEMBL328908
SMILES CN(CC(CCN1CCC2(CS(=O)(=O)c3ccccc23)CC1)c1cccs1)S(=O)(=O)c1ccccc1
InChI Key InChIKey=ODUUCTLYVCWWKP-UHFFFAOYSA-N
Data  1 IC50
  Tab Delimited (TSV)   2D SDfile   Computed 3D by Vconf -m prep SDfile
Find this compound or compounds like it in BindingDB:
Activity Spreadsheet -- Enzyme Inhibition Constant Data from BindingDB
Found 1 hit for monomerid = 50096550
TargetC-C chemokine receptor type 5(Homo sapiens (Human))
Merck Research Laboratories
Curated by ChEMBL
LigandPNGBDBM50096550(1'-[4-methyl(phenyl)sulfonamido-3-(2-thienyl)butyl...)
Affinity DataIC50:  110nM. Assay description: Inhibitory activity against specific binding of [125I]-MIP-1 alpha to human CCR5 receptor.
In DepthDetails ArticlePubMed