BDBM50096747 (S)-2-{[1-((S)-2-Mercapto-3-methyl-1-oxo-butylamino)-cyclopentanecarbonyl]-amino}-3-(4-thiophen-3-yl-phenyl)-propionic acid::CHEMBL330896
SMILES CC(C)[C@H](S)C(=O)NC1(CCCC1)C(=O)N[C@@H](Cc1ccc(cc1)-c1ccsc1)C(O)=O
InChI Key InChIKey=HXSGBZBEJQOGEJ-PMACEKPBSA-N
Data  1 IC50
  Tab Delimited (TSV)   2D SDfile   Computed 3D by Vconf -m prep SDfile
Find this compound or compounds like it in BindingDB:
Activity Spreadsheet -- Enzyme Inhibition Constant Data from BindingDB
Found 1 hit for monomerid = 50096747
TargetEndothelin-converting enzyme 1(Homo sapiens (Human))
Novartis Institute For Biomedical Research
Curated by ChEMBL
LigandPNGBDBM50096747((S)-2-{[1-((S)-2-Mercapto-3-methyl-1-oxo-butylamin...)
Affinity DataIC50:  130nM. Assay description: In vitro inhibitory activity was tested against Endothelin converting enzyme 1
In DepthDetails ArticlePubMed