BDBM50096752 3-(2',3'-Dimethoxy-biphenyl-4-yl)-2-{[1-((S)-2-mercapto-3-methyl-1-oxo-butylamino)-cyclopentanecarbonyl]-amino}-propionic acid::CHEMBL331080
SMILES COc1cccc(-c2ccc(CC(NC(=O)C3(CCCC3)NC(=O)[C@@H](S)C(C)C)C(O)=O)cc2)c1OC
InChI Key InChIKey=PZFFOWCWKXPQIC-FHZUCYEKSA-N
Data  1 IC50
  Tab Delimited (TSV)   2D SDfile   Computed 3D by Vconf -m prep SDfile
Find this compound or compounds like it in BindingDB:
Activity Spreadsheet -- Enzyme Inhibition Constant Data from BindingDB
Found 1 hit for monomerid = 50096752
TargetEndothelin-converting enzyme 1(Homo sapiens (Human))
Novartis Institute For Biomedical Research
Curated by ChEMBL
LigandPNGBDBM50096752(3-(2',3'-Dimethoxy-biphenyl-4-yl)-2-{[1-((S)-2-mer...)
Affinity DataIC50:  350nM. Assay description: In vitro inhibitory activity was tested against Endothelin converting enzyme 1
In DepthDetails ArticlePubMed