BDBM50096760 (S)-3-(4'-Chloro-biphenyl-4-yl)-2-{[1-((S)-2-mercapto-3-methyl-1-oxo-butylamino)-cyclopentanecarbonyl]-amino}-propionic acid::CHEMBL125174
SMILES CC(C)[C@H](S)C(=O)NC1(CCCC1)C(=O)N[C@@H](Cc1ccc(cc1)-c1ccc(Cl)cc1)C(O)=O
InChI Key InChIKey=BULXZQWTOSDTRR-VXKWHMMOSA-N
Data  1 IC50
  Tab Delimited (TSV)   2D SDfile   Computed 3D by Vconf -m prep SDfile
Find this compound or compounds like it in BindingDB:
Activity Spreadsheet -- Enzyme Inhibition Constant Data from BindingDB
Found 1 hit for monomerid = 50096760
TargetEndothelin-converting enzyme 1(Homo sapiens (Human))
Novartis Institute For Biomedical Research
Curated by ChEMBL
LigandPNGBDBM50096760((S)-3-(4'-Chloro-biphenyl-4-yl)-2-{[1-((S)-2-merca...)
Affinity DataIC50:  810nM. Assay description: In vitro inhibitory activity was tested against Endothelin converting enzyme 1
In DepthDetails ArticlePubMed