BDBM50096848 CHEMBL3580665
SMILES Clc1[nH]c(nc1-c1ccc2NC(=O)CCc2c1)[C@H](Cc1ccccc1)NC(=O)\C=C\c1cc(Cl)ccc1-n1cnnn1
InChI Key
Data  1 KI
  Tab Delimited (TSV)   2D SDfile   Computed 3D by Vconf -m prep SDfile
Find this compound or compounds like it in BindingDB:
Activity Spreadsheet -- Enzyme Inhibition Constant Data from BindingDB
Found 1 hit for monomerid = 50096848
TargetCoagulation factor XI(Homo sapiens (Human))
Bristol-Myers Squibb
Curated by ChEMBL
LigandPNGBDBM50096848(CHEMBL3580665)
Affinity DataKi:  19nM. Assay description: Inhibition of human coagulation factor 11a using p-nitroaniline as substrate assessed as substrate hydrolysis by spectrophotometry
In DepthDetails ArticlePubMed