BDBM50096962 CHEMBL3580900
SMILES Nc1ncnc2n(cnc12)[C@H]1[C@H](O)[C@H](O)C(CCO)=C1F
InChI Key InChIKey=QEXZQCBJBLNADX-BBBLOLIVSA-N
Data  1 IC50
  Tab Delimited (TSV)   2D SDfile   Computed 3D by Vconf -m prep SDfile
Find this compound or compounds like it in BindingDB:
Activity Spreadsheet -- Enzyme Inhibition Constant Data from BindingDB
Found 1 hit for monomerid = 50096962
TargetAdenosylhomocysteinase(Homo sapiens (Human))
Seoul National University
Curated by ChEMBL
LigandPNGBDBM50096962(CHEMBL3580900)
Affinity DataIC50:  910nM. Assay description: Inhibition of recombinant human placental AdoHcy hydrolase expressed in Escherichia coli BL21 using AdoHcy as substrate preincubated for 10 mins foll...
In DepthDetails ArticlePubMed