BDBM50096989 4-(4-{2-[2-(2,3-Dimethyl-phenyl)-1H-indol-3-yl]-ethylamino}-butyl)-phenol::CHEMBL423215
SMILES Cc1cccc(-c2[nH]c3ccccc3c2CCNCCCCc2ccc(O)cc2)c1C
InChI Key InChIKey=AHCINGBAPGVBBF-UHFFFAOYSA-N
Data  1 IC50
  Tab Delimited (TSV)   2D SDfile   Computed 3D by Vconf -m prep SDfile
Find this compound or compounds like it in BindingDB:
Activity Spreadsheet -- Enzyme Inhibition Constant Data from BindingDB
Found 1 hit for monomerid = 50096989
TargetGonadotropin-releasing hormone receptor(Rattus norvegicus)
Merck Research Laboratories
Curated by ChEMBL
LigandPNGBDBM50096989(4-(4-{2-[2-(2,3-Dimethyl-phenyl)-1H-indol-3-yl]-et...)
Affinity DataIC50:  900nM. Assay description: Ability to displace [125I]- - radio-labeled buserelin from rat Gonadotropin-releasing hormone receptor
In DepthDetails ArticlePubMed