BDBM50097035 CHEMBL149992::Methyl-carbamic acid 2-(3,5-dimethyl-phenyl)-3-{2-[4-(4-hydroxy-phenyl)-butylamino]-ethyl}-1H-indol-5-yl ester
SMILES CNC(=O)Oc1ccc2[nH]c(c(CCNCCCCc3ccc(O)cc3)c2c1)-c1cc(C)cc(C)c1
InChI Key InChIKey=DKALVTNZPLCZHM-UHFFFAOYSA-N
Data  1 IC50
  Tab Delimited (TSV)   2D SDfile   Computed 3D by Vconf -m prep SDfile
Find this compound or compounds like it in BindingDB:
Activity Spreadsheet -- Enzyme Inhibition Constant Data from BindingDB
Found 1 hit for monomerid = 50097035
TargetGonadotropin-releasing hormone receptor(Rattus norvegicus)
Merck Research Laboratories
Curated by ChEMBL
LigandPNGBDBM50097035(CHEMBL149992 | Methyl-carbamic acid 2-(3,5-dimethy...)
Affinity DataIC50:  30nM. Assay description: Binding affinity to rat Gonadotropin-releasing hormone receptor.
In DepthDetails ArticlePubMed