BDBM50097129 CHEMBL153483::N-(4-chlorophenethyl)quinazolin-4-amine::[2-(4-Chloro-phenyl)-ethyl]-quinazolin-4-yl-amine
SMILES Clc1ccc(CCNc2ncnc3ccccc23)cc1
InChI Key InChIKey=GVYCRVHJUXXHSO-UHFFFAOYSA-N
Data  1 IC50
  Tab Delimited (TSV)   2D SDfile   Computed 3D by Vconf -m prep SDfile
Find this compound or compounds like it in BindingDB:
Activity Spreadsheet -- Enzyme Inhibition Constant Data from BindingDB
Found 1 hit for monomerid = 50097129
TargetHuntingtin(Homo sapiens (Human))
Columbia University
Curated by ChEMBL
LigandPNGBDBM50097129(CHEMBL153483 | N-(4-chlorophenethyl)quinazolin-4-a...)
Affinity DataIC50:  1.05E+4nM. Assay description: Inhibition of Huntingtin protein aggregation by cell based assay
In DepthDetails ArticlePubMed