BDBM50097204 5-((1R,4aR,7S)-1,4a,7-Trimethyl-7-vinyl-1,2,3,4,4a,6,7,8,8a,9,10,10a-dodecahydro-phenanthren-1-yl)-pentanoic acid::CHEMBL116532
SMILES C[C@@]1(CC=C2C(CCC3[C@](C)(CCCCC(O)=O)CCC[C@@]23C)C1)C=C
InChI Key InChIKey=IFIXXFKTBDCXOX-OBWQMAAISA-N
Data  3 IC50
  Tab Delimited (TSV)   2D SDfile   Computed 3D by Vconf -m prep SDfile
Find this compound or compounds like it in BindingDB:
Activity Spreadsheet -- Enzyme Inhibition Constant Data from BindingDB
Found 3 hits for monomerid = 50097204
TargetProstaglandin G/H synthase 2(Ovis aries (Sheep))
Seoul National University
Curated by ChEMBL
LigandPNGBDBM50097204(5-((1R,4aR,7S)-1,4a,7-Trimethyl-7-vinyl-1,2,3,4,4a...)
Affinity DataIC50:  3.87E+4nM. Assay description: Inhibitory activity against Prostaglandin G/H synthase 2 from sheep placental cotyledons
In DepthDetails ArticlePubMed
TargetProstaglandin G/H synthase 2(Ovis aries (Sheep))
Seoul National University
Curated by ChEMBL
LigandPNGBDBM50097204(5-((1R,4aR,7S)-1,4a,7-Trimethyl-7-vinyl-1,2,3,4,4a...)
Affinity DataIC50:  3.87E+4nM. Assay description: In vitro inhibition of Prostaglandin G/H synthase 2 from sheep placental cotyledons
In DepthDetails ArticlePubMed
TargetProstaglandin G/H synthase 1(Homo sapiens (Human))
Seoul National University
Curated by ChEMBL
LigandPNGBDBM50097204(5-((1R,4aR,7S)-1,4a,7-Trimethyl-7-vinyl-1,2,3,4,4a...)
Affinity DataIC50:  5.26E+4nM. Assay description: Inhibitory activity against Prostaglandin G/H synthase 1 from rabbit renal microsomes
In DepthDetails ArticlePubMed