BDBM50097418 CHEMBL41816
SMILES Nc1ncc2CN=C(c3ccccc3F)c3cc(Cl)ccc3-c2n1
InChI Key InChIKey=FBRAIVNJLBZIIY-UHFFFAOYSA-N
Data  3 IC50
  Tab Delimited (TSV)   2D SDfile   Computed 3D by Vconf -m prep SDfile
Find this compound or compounds like it in BindingDB:
Activity Spreadsheet -- Enzyme Inhibition Constant Data from BindingDB
Found 3 hits for monomerid = 50097418
TargetAurora kinase B(Homo sapiens (Human))
Takeda Pharmaceutical
Curated by ChEMBL
LigandPNGBDBM50097418(CHEMBL41816)
Affinity DataIC50: >1.00E+4nM. Assay description: Inhibition of aurora kinase B in human HCT116 cells assessed as inhibition of histone H3 phosphorylation by immunofluorescence analysis
In DepthDetails ArticlePubMed
TargetAurora kinase A(Mus musculus (mouse))
Takeda Pharmaceutical
Curated by ChEMBL
LigandPNGBDBM50097418(CHEMBL41816)
Affinity DataIC50:  1.70E+3nM. Assay description: Inhibition of recombinant mouse aurora kinase A expressed in insect Sf9 cells using biotin-GLRRASLG as substrate in presence of [gamma-33P]ATP
In DepthDetails ArticlePubMed
TargetAurora kinase A(Homo sapiens (Human))
Takeda Pharmaceutical
Curated by ChEMBL
LigandPNGBDBM50097418(CHEMBL41816)
Affinity DataIC50:  6.00E+3nM. Assay description: Inhibition of aurora kinase A autophosphorylation at T288 in human HCT116 cells by immunofluorescence analysis
In DepthDetails ArticlePubMed