BDBM50097450 3,4-Dichloro-N-(4-pyridin-2-yl-thiazol-2-yl)-benzamide::CHEMBL349715
SMILES Clc1ccc(cc1Cl)C(=O)Nc1nc(cs1)-c1ccccn1
InChI Key InChIKey=CXSGUJMITTULMK-UHFFFAOYSA-N
Data  2 KI
  Tab Delimited (TSV)   2D SDfile   Computed 3D by Vconf -m prep SDfile
Find this compound or compounds like it in BindingDB:
Activity Spreadsheet -- Enzyme Inhibition Constant Data from BindingDB
Found 2 hits for monomerid = 50097450
TargetAdenosine receptor A1(Rattus norvegicus (rat))
Vrije Universiteit
Curated by ChEMBL
LigandPNGBDBM50097450(3,4-Dichloro-N-(4-pyridin-2-yl-thiazol-2-yl)-benza...)
Affinity DataKi:  1.60E+3nM. Assay description: Displacement of [3H]DPCPX binding to adenosine A1 receptor of rat brain cortical membrane
In DepthDetails ArticlePubMed
TargetAdenosine receptor A3(Homo sapiens (Human))
Vrije Universiteit
Curated by ChEMBL
LigandPNGBDBM50097450(3,4-Dichloro-N-(4-pyridin-2-yl-thiazol-2-yl)-benza...)
Affinity DataKi:  2.50E+3nM. Assay description: Displacement of [125I]AB-MECA from human adenosine A3 receptor expressed in HEK 293 cells
In DepthDetails ArticlePubMed