BDBM50097452 CHEMBL354004::[4-(3-Phenyl-[1,2,4]thiadiazol-5-ylcarbamoyl)-phenoxy]-acetic acid
SMILES OC(=O)COc1ccc(cc1)C(=O)Nc1nc(ns1)-c1ccccc1
InChI Key InChIKey=JZAHMVTXFHMSNE-UHFFFAOYSA-N
Data  3 KI
  Tab Delimited (TSV)   2D SDfile   Computed 3D by Vconf -m prep SDfile
Find this compound or compounds like it in BindingDB:
Activity Spreadsheet -- Enzyme Inhibition Constant Data from BindingDB
Found 3 hits for monomerid = 50097452
TargetAdenosine receptor A1(Rattus norvegicus (rat))
Vrije Universiteit
Curated by ChEMBL
LigandPNGBDBM50097452(CHEMBL354004 | [4-(3-Phenyl-[1,2,4]thiadiazol-5-yl...)
Affinity DataKi:  100nM. Assay description: Displacement of [3H]DPCPX binding to adenosine A1 receptor of rat brain cortical membrane
In DepthDetails ArticlePubMed
TargetAdenosine receptor A3(Homo sapiens (Human))
Vrije Universiteit
Curated by ChEMBL
LigandPNGBDBM50097452(CHEMBL354004 | [4-(3-Phenyl-[1,2,4]thiadiazol-5-yl...)
Affinity DataKi:  1.20E+3nM. Assay description: Displacement of [125I]AB-MECA from human adenosine A3 receptor expressed in HEK 293 cells
In DepthDetails ArticlePubMed
TargetAdenosine receptor A2a(Rattus norvegicus (rat))
Vrije Universiteit
Curated by ChEMBL
LigandPNGBDBM50097452(CHEMBL354004 | [4-(3-Phenyl-[1,2,4]thiadiazol-5-yl...)
Affinity DataKi:  1.50E+4nM. Assay description: Displacement of [3H]-CGS-21,680 or [3H]ZM-241385 binding in adenosine A2A receptor of rat striatal membrane was determined
In DepthDetails ArticlePubMed