BDBM50097683 CHEMBL3589588
SMILES COc1cc(CCNCc2ccccn2)c(OC)cc1Br
InChI Key InChIKey=FTGWSNODMDDJLT-UHFFFAOYSA-N
Data  2 KI
  Tab Delimited (TSV)   2D SDfile   Computed 3D by Vconf -m prep SDfile
Find this compound or compounds like it in BindingDB:
Activity Spreadsheet -- Enzyme Inhibition Constant Data from BindingDB
Found 2 hits for monomerid = 50097683
Target5-hydroxytryptamine receptor 2A(Homo sapiens (Human))
University Of Copenhagen
Curated by ChEMBL
LigandPNGBDBM50097683(CHEMBL3589588)
Affinity DataKi:  39nM. Assay description: Binding affinity to 5-HT2A receptor (unknown origin) by PDSP assay
In DepthDetails ArticlePubMed
Target5-hydroxytryptamine receptor 2C(Homo sapiens (Human))
University Of Copenhagen
Curated by ChEMBL
LigandPNGBDBM50097683(CHEMBL3589588)
Affinity DataKi:  42nM. Assay description: Binding affinity to 5-HT2C receptor (unknown origin) by PDSP assay
In DepthDetails ArticlePubMed