BDBM50097689 CHEMBL3589594
SMILES COc1cccc(OC)c1CNCCc1cc(OC)c(Br)cc1OC
InChI Key InChIKey=LTMHOYKRAWHOMY-UHFFFAOYSA-N
Data  2 KI  2 EC50
  Tab Delimited (TSV)   2D SDfile   Computed 3D by Vconf -m prep SDfile
Find this compound or compounds like it in BindingDB:
Activity Spreadsheet -- Enzyme Inhibition Constant Data from BindingDB
Found 4 hits for monomerid = 50097689
Target5-hydroxytryptamine receptor 2C(Homo sapiens (Human))
University Of Copenhagen
Curated by ChEMBL
LigandPNGBDBM50097689(CHEMBL3589594)
Affinity DataKi:  17nM. Assay description: Binding affinity to 5-HT2C receptor (unknown origin) by PDSP assay
In DepthDetails ArticlePubMed
Target5-hydroxytryptamine receptor 2A(Homo sapiens (Human))
University Of Copenhagen
Curated by ChEMBL
LigandPNGBDBM50097689(CHEMBL3589594)
Affinity DataKi:  316nM. Assay description: Binding affinity to 5-HT2A receptor (unknown origin) by PDSP assay
In DepthDetails ArticlePubMed
Target5-hydroxytryptamine receptor 2C(Homo sapiens (Human))
University Of Copenhagen
Curated by ChEMBL
LigandPNGBDBM50097689(CHEMBL3589594)
Affinity DataEC50:  8.71E+4nMT: 2°C. Assay description: Partial agonist activity at human 5-HT2C receptor expressed in HEK293 cells preincubated for 1 hr at 37 degC followed by incubated for 15 mins at roo...
In DepthDetails ArticlePubMed
Target5-hydroxytryptamine receptor 2A(Homo sapiens (Human))
University Of Copenhagen
Curated by ChEMBL
LigandPNGBDBM50097689(CHEMBL3589594)
Affinity DataEC50:  5.37E+3nMT: 2°C. Assay description: Partial agonist activity at human 5-HT2A receptor expressed in HEK293 cells preincubated for 1 hr at 37 degC followed by incubated for 15 mins at roo...
In DepthDetails ArticlePubMed