BDBM50097690 CHEMBL3589595
SMILES COc1cccc(CNCCc2cc(OC)c(Br)cc2OC)c1F
InChI Key InChIKey=MLQOKWSMWZUBCM-HNKWHGCMSA-N
Data  2 KI  2 EC50
  Tab Delimited (TSV)   2D SDfile   Computed 3D by Vconf -m prep SDfile
Find this compound or compounds like it in BindingDB:
Activity Spreadsheet -- Enzyme Inhibition Constant Data from BindingDB
Found 4 hits for monomerid = 50097690
Target5-hydroxytryptamine receptor 2A(Homo sapiens (Human))
University Of Copenhagen
Curated by ChEMBL
LigandPNGBDBM50097690(CHEMBL3589595)
Affinity DataKi:  3.30nM. Assay description: Binding affinity to 5-HT2A receptor (unknown origin) by PDSP assay
In DepthDetails ArticlePubMed
Target5-hydroxytryptamine receptor 2C(Homo sapiens (Human))
University Of Copenhagen
Curated by ChEMBL
LigandPNGBDBM50097690(CHEMBL3589595)
Affinity DataKi:  56nM. Assay description: Binding affinity to 5-HT2C receptor (unknown origin) by PDSP assay
In DepthDetails ArticlePubMed
Target5-hydroxytryptamine receptor 2C(Homo sapiens (Human))
University Of Copenhagen
Curated by ChEMBL
LigandPNGBDBM50097690(CHEMBL3589595)
Affinity DataEC50:  282nMT: 2°C. Assay description: Partial agonist activity at human 5-HT2C receptor expressed in HEK293 cells preincubated for 1 hr at 37 degC followed by incubated for 15 mins at roo...
In DepthDetails ArticlePubMed
Target5-hydroxytryptamine receptor 2A(Homo sapiens (Human))
University Of Copenhagen
Curated by ChEMBL
LigandPNGBDBM50097690(CHEMBL3589595)
Affinity DataEC50:  105nMT: 2°C. Assay description: Partial agonist activity at human 5-HT2A receptor expressed in HEK293 cells preincubated for 1 hr at 37 degC followed by incubated for 15 mins at roo...
In DepthDetails ArticlePubMed