BDBM50097734 1-(2-nitrophenyl)thiosemicarbazide analogue::CHEMBL159623
SMILES OC(=O)c1ccc(NC(=[SH+])[N-]Nc2ccc(cc2[N+]([O-])=O)S(=O)(=O)NCCc2c[nH]c3ccccc23)cc1
InChI Key InChIKey=CSAZYUNHDIEVDB-UHFFFAOYSA-N
Data  2 IC50
  Tab Delimited (TSV)   2D SDfile   Computed 3D by Vconf -m prep SDfile
Find this compound or compounds like it in BindingDB:
Activity Spreadsheet -- Enzyme Inhibition Constant Data from BindingDB
Found 2 hits for monomerid = 50097734
TargetB2 bradykinin receptor(RAT)
Novartis Institute For Medical Sciences
Curated by ChEMBL
LigandPNGBDBM50097734(1-(2-nitrophenyl)thiosemicarbazide analogue | CHEM...)
Affinity DataIC50: >1.00E+5nM. Assay description: In vitro binding affinity against Bradykinin receptor B2 in rat NG 108-15 neuroblastoma-glioma hybrid cell membranes using [3H]BK binding assay
In DepthDetails ArticlePubMed
TargetGastrin/cholecystokinin type B receptor(MOUSE)
Novartis Institute For Medical Sciences
Curated by ChEMBL
LigandPNGBDBM50097734(1-(2-nitrophenyl)thiosemicarbazide analogue | CHEM...)
Affinity DataIC50:  2.40E+4nM. Assay description: In vitro binding affinity against Cholecystokinin type B receptor in mouse cerebral cortical membranes using [125I]Tyr(SO3H)27]-CCK-8 binding assay
In DepthDetails ArticlePubMed