BDBM50097747 CHEMBL162552::[2-Amino-3-((S)-4-hydroxy-phenyl)-propionylamino]-((2S,3R,4R,5R,6R)-3,4,5-trihydroxy-6-hydroxymethyl-tetrahydro-pyran-2-yl)-acetic acid
SMILES N[C@@H](Cc1ccc(O)cc1)C(=O)NC([C@@H]1O[C@H](CO)[C@H](O)[C@H](O)[C@H]1O)C(O)=O
InChI Key InChIKey=QMDZPOJZRZEFED-YFVZCRMOSA-N
Data  1 IC50
  Tab Delimited (TSV)   2D SDfile   Computed 3D by Vconf -m prep SDfile
Find this compound or compounds like it in BindingDB:
Activity Spreadsheet -- Enzyme Inhibition Constant Data from BindingDB
Found 1 hit for monomerid = 50097747
TargetTyrosine--tRNA ligase, cytoplasmic(Homo sapiens (Human))
Glaxosmithkline
Curated by ChEMBL
LigandPNGBDBM50097747(CHEMBL162552 | [2-Amino-3-((S)-4-hydroxy-phenyl)-p...)
Affinity DataIC50:  190nM. Assay description: Inhibitory activity against Staphylococcus aureus tyrosyl tRNA synthetase (YRS) using aminoacylation assay
In DepthDetails ArticlePubMed