BDBM50097804 5-(4-{4-[2-Hydroxy-2-(2-oxo-1,2-dihydro-quinolin-5-yloxy)-ethylamino]-piperidin-1-yl}-benzyl)-thiazolidine-2,4-dione::CHEMBL161949
SMILES O[C@@H](CNC1CCN(CC1)c1ccc(Cc2sc(=O)[nH]c2O)cc1)Oc1cccc2[nH]c(=O)ccc12
InChI Key InChIKey=BIKQQCJDQLEKDX-XMMPIXPASA-N
Data  2 EC50
  Tab Delimited (TSV)   2D SDfile   Computed 3D by Vconf -m prep SDfile
Find this compound or compounds like it in BindingDB:
Activity Spreadsheet -- Enzyme Inhibition Constant Data from BindingDB
Found 2 hits for monomerid = 50097804
TargetBeta-1 adrenergic receptor(Homo sapiens (Human))
Wyeth-Ayerst Research
Curated by ChEMBL
LigandPNGBDBM50097804(5-(4-{4-[2-Hydroxy-2-(2-oxo-1,2-dihydro-quinolin-5...)
Affinity DataEC50:  1.53E+3nM. Assay description: Agonistic activity as cAMP accumulation in CHO cells expressing human beta-1-adrenergic receptor
In DepthDetails ArticlePubMed
TargetBeta-3 adrenergic receptor(Homo sapiens (Human))
Wyeth-Ayerst Research
Curated by ChEMBL
LigandPNGBDBM50097804(5-(4-{4-[2-Hydroxy-2-(2-oxo-1,2-dihydro-quinolin-5...)
Affinity DataEC50:  13nM. Assay description: Agonistic activity as cAMP accumulation in CHO cells expressing human beta-3-andrenergic receptor
In DepthDetails ArticlePubMed