BDBM50097827 CHEMBL3588990
SMILES COc1ccccc1N1CCN(CC(O)CCn2cc(nn2)-c2ccc(cc2)-c2ccccc2)CC1
InChI Key InChIKey=NEGKSWMIZLWJGG-UHFFFAOYSA-N
Data  3 KI
  Tab Delimited (TSV)   2D SDfile   Computed 3D by Vconf -m prep SDfile
Find this compound or compounds like it in BindingDB:
Activity Spreadsheet -- Enzyme Inhibition Constant Data from BindingDB
Found 3 hits for monomerid = 50097827
TargetD(3) dopamine receptor(Homo sapiens (Human))
National Institute On Drug Abuse-Intramural Research Program
Curated by ChEMBL
LigandPNGBDBM50097827(CHEMBL3588990)
Affinity DataKi:  31nM. Assay description: Displacement of [3H]-N-methylspiperone from human dopamine D3 receptor expressed in HEK293 cell membranes after 1 hr by liquid scintillation counting...
In DepthDetails ArticlePubMed
TargetD(2) dopamine receptor(Homo sapiens (Human))
National Institute On Drug Abuse-Intramural Research Program
Curated by ChEMBL
LigandPNGBDBM50097827(CHEMBL3588990)
Affinity DataKi:  819nM. Assay description: Displacement of [3H]-N-methylspiperone from human dopamine D2 receptor expressed in HEK293 cell membranes after 1 hr by liquid scintillation counting...
In DepthDetails ArticlePubMed
TargetD(4) dopamine receptor(Homo sapiens (Human))
National Institute On Drug Abuse-Intramural Research Program
Curated by ChEMBL
LigandPNGBDBM50097827(CHEMBL3588990)
Affinity DataKi: >2.00E+3nM. Assay description: Displacement of [3H]-N-methylspiperone from human dopamine D4 receptor expressed in HEK293 cell membranes after 1 hr by liquid scintillation counting...
In DepthDetails ArticlePubMed