BDBM50097940 2-({3-[4-Amino-5-(3-methoxy-phenyl)-pyrrolo[2,3-d]pyrimidin-7-yl]-cyclobutylmethyl}-amino)-ethanol::CHEMBL168550
SMILES COc1cccc(c1)-c1cn(C2CC(CNCCO)C2)c2ncnc(N)c12
InChI Key InChIKey=TWUSYQHQSFRUMW-UHFFFAOYSA-N
Data  4 IC50
  Tab Delimited (TSV)   2D SDfile   Computed 3D by Vconf -m prep SDfile
Find this compound or compounds like it in BindingDB:
Activity Spreadsheet -- Enzyme Inhibition Constant Data from BindingDB
Found 4 hits for monomerid = 50097940
TargetProto-oncogene tyrosine-protein kinase Src(Gallus gallus (Chicken))
Novartis Pharma Research
Curated by ChEMBL
LigandPNGBDBM50097940(2-({3-[4-Amino-5-(3-methoxy-phenyl)-pyrrolo[2,3-d]...)
Affinity DataIC50:  300nM. Assay description: Inhibition of p60 c-Src tyrosine kinase mediated phosphorylation of Fak in IC8.1 fibroblasts
In DepthDetails ArticlePubMed
TargetTyrosine-protein kinase ABL1/ABL2(Homo sapiens (Human))
Novartis Pharma Research
Curated by ChEMBL
LigandPNGBDBM50097940(2-({3-[4-Amino-5-(3-methoxy-phenyl)-pyrrolo[2,3-d]...)
Affinity DataIC50:  420nM. Assay description: Inhibition of v-Abl tyrosine kinase activity
In DepthDetails ArticlePubMed
TargetProto-oncogene tyrosine-protein kinase Src(Gallus gallus (Chicken))
Novartis Pharma Research
Curated by ChEMBL
LigandPNGBDBM50097940(2-({3-[4-Amino-5-(3-methoxy-phenyl)-pyrrolo[2,3-d]...)
Affinity DataIC50:  20nM. Assay description: Inhibition of p60 c-Src tyrosine kinase activity
In DepthDetails ArticlePubMed
TargetEpidermal growth factor receptor(Homo sapiens (Human))
Novartis Pharma Research
Curated by ChEMBL
LigandPNGBDBM50097940(2-({3-[4-Amino-5-(3-methoxy-phenyl)-pyrrolo[2,3-d]...)
Affinity DataIC50:  490nM. Assay description: Inhibition of Epidermal growth factor receptor (EGF-R) tyrosine kinase activity
In DepthDetails ArticlePubMed