BDBM50098007 CHEMBL3590216
SMILES CCCCOc1ccc(cc1)C(=O)NN1Cc2ccccc2NC1c1ccc(C)cc1
InChI Key InChIKey=GGRQDEOVQXCXCL-UHFFFAOYSA-N
Data  1 IC50  1 EC50
  Tab Delimited (TSV)   2D SDfile   Computed 3D by Vconf -m prep SDfile
Find this compound or compounds like it in BindingDB:
Activity Spreadsheet -- Enzyme Inhibition Constant Data from BindingDB
Found 2 hits for monomerid = 50098007
TargetN-formyl peptide receptor 2(Homo sapiens (Human))
University Of Warsaw
Curated by ChEMBL
LigandPNGBDBM50098007(CHEMBL3590216)
Affinity DataEC50:  1.48E+3nM. Assay description: Agonist activity at human FPR2 expressed in rat RBL-2H3 cells by intracellular Ca2+ mobilization assay
In DepthDetails ArticlePubMed
TargetN-formyl peptide receptor 2(Homo sapiens (Human))
University Of Warsaw
Curated by ChEMBL
LigandPNGBDBM50098007(CHEMBL3590216)
Affinity DataIC50:  170nM. Assay description: Antagonist activity against human FPR2 expressed in rat RBL-2H3 cells pre-treated for 15 mins before addition of WKYMVm or C1 by intracellular Ca2+ m...
In DepthDetails ArticlePubMed