BDBM50098047 CHEMBL3590214
SMILES COc1ccc2[nH]c(SCC(=O)Nc3ccccc3Cl)nc2c1
InChI Key InChIKey=TZKXQUHVSPBVAK-UHFFFAOYSA-N
Data  1 IC50  1 EC50
  Tab Delimited (TSV)   2D SDfile   Computed 3D by Vconf -m prep SDfile
Find this compound or compounds like it in BindingDB:
Activity Spreadsheet -- Enzyme Inhibition Constant Data from BindingDB
Found 2 hits for monomerid = 50098047
TargetMethylosome protein 50/Protein arginine N-methyltransferase 5(Homo sapiens (Human))
Shandong University
Curated by ChEMBL
LigandPNGBDBM50098047(CHEMBL3590214)
Affinity DataIC50:  4.70E+4nM. Assay description: Inhibition of noradrenaline uptake in rat synaptosomal fraction
In DepthDetails ArticlePubMed
TargetN-formyl peptide receptor 2(Homo sapiens (Human))
University Of Warsaw
Curated by ChEMBL
LigandPNGBDBM50098047(CHEMBL3590214)
Affinity DataEC50:  1.00E+4nM. Assay description: Agonist activity against human FPR2 expressed in human HL60 cells by Fluo-4AM dye based intracellular Ca2+ mobilization assay
In DepthDetails ArticlePubMed