BDBM50098093 4-[4-(Benzo[1,3]dioxole-5-sulfonyl)-phenoxy]-1'-ethanesulfonyl-[1,4']bipiperidinyl::CHEMBL355169
SMILES CCS(=O)(=O)N1CCC(CC1)N1CCC(CC1)Oc1ccc(cc1)S(=O)(=O)c1ccc2OCOc2c1
InChI Key InChIKey=VSAJEECGHQJYJT-UHFFFAOYSA-N
Data  1 KI
  Tab Delimited (TSV)   2D SDfile   Computed 3D by Vconf -m prep SDfile
Find this compound or compounds like it in BindingDB:
Activity Spreadsheet -- Enzyme Inhibition Constant Data from BindingDB
Found 1 hit for monomerid = 50098093
TargetMuscarinic acetylcholine receptor M2(Homo sapiens (Human))
Schering-Plough Research Institute
Curated by ChEMBL
LigandPNGBDBM50098093(4-[4-(Benzo[1,3]dioxole-5-sulfonyl)-phenoxy]-1'-et...)
Affinity DataKi:  2nM. Assay description: Binding affinity towards Muscarinic acetylcholine receptor M2 stably expressed in CHO-K1 cells using [3H]-QNB as radioligand
In DepthDetails ArticlePubMed