BDBM50098095 (3S,3aR,6aS)-3-Isopropyl-1-methanesulfonyl-5-((E)-4-piperidin-1-yl-but-2-enoyl)-hexahydro-pyrrolo[3,4-b]pyrrol-2-one; hydrochloride::CHEMBL558367
SMILES CC(C)[C@H]1[C@@H]2CN(C[C@H]2N(C1=O)S(C)(=O)=O)C(=O)\C=C\CN1CCCCC1
InChI Key InChIKey=NFSSMVLQBBUNAH-PKEJXYEUSA-N
Data  1 IC50
  Tab Delimited (TSV)   2D SDfile   Computed 3D by Vconf -m prep SDfile
Find this compound or compounds like it in BindingDB:
Activity Spreadsheet -- Enzyme Inhibition Constant Data from BindingDB
Found 1 hit for monomerid = 50098095
TargetNeutrophil elastase(Homo sapiens (Human))
Glaxowellcome Medicines Research Centre
Curated by ChEMBL
LigandPNGBDBM50098095((3S,3aR,6aS)-3-Isopropyl-1-methanesulfonyl-5-((E)-...)
Affinity DataIC50:  22nM. Assay description: Inhibitory concentration against Elastase
In DepthDetails ArticlePubMed