BDBM50098246 CHEMBL9111::N-{1-[4-(Amino-hydrazino-methyl)-benzyl]-2-oxo-2-piperidin-1-yl-ethyl}-2-(naphthalene-2-sulfonylamino)-acetamide
SMILES NNC(N)c1ccc(C[C@@H](NC(=O)CNS(=O)(=O)c2ccc3ccccc3c2)C(=O)N2CCCCC2)cc1
InChI Key InChIKey=ATSYKJRPTVEDKS-RMVMEJTISA-N
Data  1 KI
  Tab Delimited (TSV)   2D SDfile   Computed 3D by Vconf -m prep SDfile
Find this compound or compounds like it in BindingDB:
Activity Spreadsheet -- Enzyme Inhibition Constant Data from BindingDB
Found 1 hit for monomerid = 50098246
TargetProthrombin(Bos taurus (Bovine))
Yale University
Curated by ChEMBL
LigandPNGBDBM50098246(CHEMBL9111 | N-{1-[4-(Amino-hydrazino-methyl)-benz...)
Affinity DataKi:  4.32E+3nM. Assay description: Binding affinity was determined against bovine thrombin.
In DepthDetails ArticlePubMed