BDBM50098309 CHEMBL3590398
SMILES Cc1cc2ccnc(N[C@@H]3CCNC[C@H]3OC[C@@H]3CCS(=O)(=O)C3)c2[nH]c1=O
InChI Key
Data  2 IC50
  Tab Delimited (TSV)   2D SDfile   Computed 3D by Vconf -m prep SDfile
Find this compound or compounds like it in BindingDB:
Activity Spreadsheet -- Enzyme Inhibition Constant Data from BindingDB
Found 2 hits for monomerid = 50098309
TargetBromodomain-containing protein 4(Homo sapiens (Human))
Glaxosmithkline
Curated by ChEMBL
LigandPNGBDBM50098309(CHEMBL3590398)
Affinity DataIC50:  1.26E+4nM. Assay description: Displacement of I-BET762 from 6His-Thr-BRD4 (1 to 477) BD1 (unknown origin) harboring BD2 Y390A mutant after 30 mins by TR-FRET analysis
In DepthDetails ArticlePubMed
TargetATPase family AAA domain-containing protein 2(Homo sapiens (Human))
Glaxosmithkline
Curated by ChEMBL
LigandPNGBDBM50098309(CHEMBL3590398)
Affinity DataIC50:  5.01E+3nM. Assay description: Displacement of histone H4 peptide from FLAG-6His-Tev-ATAD2 (981 to 1121) (unknown origin) expressed in Escherichia coli BL21 (DE3) after 30 mins by ...
In DepthDetails ArticlePubMed