BDBM50098433 CHEMBL3593429
SMILES O=c1[nH]c2cnc3[nH]ccc3c2n1C1CCCC1
InChI Key InChIKey=HQEGPPMLWHPDIN-UHFFFAOYSA-N
Data  3 IC50
  Tab Delimited (TSV)   2D SDfile   Computed 3D by Vconf -m prep SDfile
Find this compound or compounds like it in BindingDB:
Activity Spreadsheet -- Enzyme Inhibition Constant Data from BindingDB
Found 3 hits for monomerid = 50098433
TargetTyrosine-protein kinase JAK3(Homo sapiens (Human))
Astellas Pharma
Curated by ChEMBL
LigandPNGBDBM50098433(CHEMBL3593429)
Affinity DataIC50:  180nM. Assay description: Inhibition of human JAK3 kinase domain using biotin-Lyn-substrate-2 as substrate and ATP incubated for 1 hr by ELISA method
In DepthDetails ArticlePubMed
TargetTyrosine-protein kinase JAK1(Homo sapiens (Human))
Astellas Pharma
Curated by ChEMBL
LigandPNGBDBM50098433(CHEMBL3593429)
Affinity DataIC50:  110nM. Assay description: Inhibition of human JAK1 kinase domain using biotin-Lyn-substrate-2 as substrate and ATP incubated for 1 hr by ELISA method
In DepthDetails ArticlePubMed
TargetTyrosine-protein kinase JAK2(Homo sapiens (Human))
Astellas Pharma
Curated by ChEMBL
LigandPNGBDBM50098433(CHEMBL3593429)
Affinity DataIC50:  97nM. Assay description: Inhibition of human JAK2 kinase domain using biotin-Lyn-substrate-2 as substrate and ATP incubated for 1 hr by ELISA method
In DepthDetails ArticlePubMed